BDBM50029156 1-Methyl-3-[2-(1-methyl-piperidin-4-yl)-ethyl]-1H-indole; hydrochloride::CHEMBL544216
SMILES CN1CCC(CCc2cn(C)c3ccccc23)CC1
InChI Key InChIKey=UNRQUBJIEJFQTD-UHFFFAOYSA-N
Data  4 IC50
  Tab Delimited (TSV)   2D SDfile   Computed 3D by Vconf -m prep SDfile
Find this compound or compounds like it in BindingDB:
Activity Spreadsheet -- Enzyme Inhibition Constant Data from BindingDB
Found 4 hits for monomerid = 50029156
TargetSodium-dependent dopamine transporter(Rattus norvegicus (rat))
TBA
Curated by ChEMBL
LigandPNGBDBM50029156(1-Methyl-3-[2-(1-methyl-piperidin-4-yl)-ethyl]-1H-...)
Affinity DataIC50: >1.00E+5nM. Assay description: Inhibition of uptake of dopamine (DA) rat brain striatum
In DepthDetails ArticlePubMed
TargetSodium-dependent serotonin transporter(Rattus norvegicus (rat))
TBA
Curated by ChEMBL
LigandPNGBDBM50029156(1-Methyl-3-[2-(1-methyl-piperidin-4-yl)-ethyl]-1H-...)
Affinity DataIC50:  1.70E+3nM. Assay description: Inhibition of uptake of 5-HT in rat brain cortex
In DepthDetails ArticlePubMed
TargetSodium-dependent serotonin transporter(Homo sapiens (Human))
TBA
Curated by ChEMBL
LigandPNGBDBM50029156(1-Methyl-3-[2-(1-methyl-piperidin-4-yl)-ethyl]-1H-...)
Affinity DataIC50: >1.00E+3nM. Assay description: In vivo inhibition of uptake of 5-HT in human platelets
In DepthDetails ArticlePubMed
TargetTransporter(Rattus norvegicus)
TBA
Curated by ChEMBL
LigandPNGBDBM50029156(1-Methyl-3-[2-(1-methyl-piperidin-4-yl)-ethyl]-1H-...)
Affinity DataIC50: >1.00E+4nM. Assay description: Inhibition of uptake of noradrenaline in rat brain hypothalamus
In DepthDetails ArticlePubMed