BDBM50029208 6,7-Dihydroxy-2-imino-2H-chromene-3-carboxylic acid amide::CHEMBL132379
SMILES NC(=O)c1cc2cc(O)c(O)cc2oc1=N
InChI Key InChIKey=NGPLDNSVQRNKAF-UHFFFAOYSA-N
Data  2 IC50
  Tab Delimited (TSV)   2D SDfile   Computed 3D by Vconf -m prep SDfile
Find this compound or compounds like it in BindingDB:
Activity Spreadsheet -- Enzyme Inhibition Constant Data from BindingDB
Found 2 hits for monomerid = 50029208
TargetTyrosine-protein kinase Lck(Homo sapiens (Human))
National Cancer Institute-Bethesda
Curated by ChEMBL
LigandPNGBDBM50029208(6,7-Dihydroxy-2-imino-2H-chromene-3-carboxylic aci...)
Affinity DataIC50: >2.00E+6nM. Assay description: Ability to inhibit autophosphorylation of immunopurified p56Ick
In DepthDetails ArticlePubMed
TargetIntegrase(Human immunodeficiency virus 1)
National Cancer Institute-Bethesda
Curated by ChEMBL
LigandPNGBDBM50029208(6,7-Dihydroxy-2-imino-2H-chromene-3-carboxylic aci...)
Affinity DataIC50:  4.80E+4nM. Assay description: In vitro inhibitory activity against HIV-1 integrase.
In DepthDetails ArticlePubMed