BDBM50029210 (E)-3-(3,4-Dihydroxy-phenyl)-acrylic acid 2-naphthalen-1-yl-ethyl ester::3-(3,4-Dihydroxy-phenyl)-acrylic acid 2-naphthalen-1-yl-ethyl ester::CHEMBL133491
SMILES Oc1ccc(\C=C\C(=O)OCCc2cccc3ccccc23)cc1O
InChI Key InChIKey=VFBDUQDKOJTRNI-PKNBQFBNSA-N
Data  2 IC50
  Tab Delimited (TSV)   2D SDfile   Computed 3D by Vconf -m prep SDfile
Find this compound or compounds like it in BindingDB:
Activity Spreadsheet -- Enzyme Inhibition Constant Data from BindingDB
Found 2 hits for monomerid = 50029210
TargetIntegrase(Human immunodeficiency virus 1)
University Of Tennessee Health Science Center
Curated by ChEMBL
LigandPNGBDBM50029210((E)-3-(3,4-Dihydroxy-phenyl)-acrylic acid 2-naphth...)
Affinity DataIC50:  1.51E+4nM. Assay description: Inhibitory activity against HIV-1 Integrase (HIV-1-IN)
In DepthDetails ArticlePubMed
TargetIntegrase(Human immunodeficiency virus 1)
University Of Tennessee Health Science Center
Curated by ChEMBL
LigandPNGBDBM50029210((E)-3-(3,4-Dihydroxy-phenyl)-acrylic acid 2-naphth...)
Affinity DataIC50:  1.50E+4nM. Assay description: In vitro inhibitory activity against HIV-1 integrase.
In DepthDetails ArticlePubMed