BDBM50029218 (E)-3-(3,4,5-Trihydroxy-phenyl)-acrylic acid phenethyl ester::3-(3,4,5-Trihydroxy-phenyl)-acrylic acid phenethyl ester::CHEMBL131733
SMILES Oc1cc(\C=C\C(=O)OCCc2ccccc2)cc(O)c1O
InChI Key InChIKey=COUZOAATCDRXRK-VOTSOKGWSA-N
Data  2 IC50
  Tab Delimited (TSV)   2D SDfile   Computed 3D by Vconf -m prep SDfile
Find this compound or compounds like it in BindingDB:
Activity Spreadsheet -- Enzyme Inhibition Constant Data from BindingDB
Found 2 hits for monomerid = 50029218
TargetIntegrase(Human immunodeficiency virus 1)
University Of Tennessee Health Science Center
Curated by ChEMBL
LigandPNGBDBM50029218((E)-3-(3,4,5-Trihydroxy-phenyl)-acrylic acid phene...)
Affinity DataIC50:  2.00E+3nM. Assay description: Inhibitory activity against HIV-1 Integrase (HIV-1-IN)
In DepthDetails ArticlePubMed
TargetIntegrase(Human immunodeficiency virus 1)
University Of Tennessee Health Science Center
Curated by ChEMBL
LigandPNGBDBM50029218((E)-3-(3,4,5-Trihydroxy-phenyl)-acrylic acid phene...)
Affinity DataIC50:  2.00E+3nM. Assay description: In vitro inhibitory activity against HIV-1 integrase.
In DepthDetails ArticlePubMed