BDBM50029298 1-(2-Isopropoxy-phenyl)-4-(3-piperidin-1-ylmethyl-benzyl)-piperazine::CHEMBL422989
SMILES CC(C)Oc1ccccc1N1CCN(Cc2cccc(CN3CCCCC3)c2)CC1
InChI Key InChIKey=IOOQIYLBXKDKDD-UHFFFAOYSA-N
Data  2 KI
  Tab Delimited (TSV)   2D SDfile   Computed 3D by Vconf -m prep SDfile
Find this compound or compounds like it in BindingDB:
Activity Spreadsheet -- Enzyme Inhibition Constant Data from BindingDB
Found 2 hits for monomerid = 50029298
TargetD(2) dopamine receptor(Rattus norvegicus (rat))
R. W. Johnson Pharmaceutical Research Institute
Curated by ChEMBL
LigandPNGBDBM50029298(1-(2-Isopropoxy-phenyl)-4-(3-piperidin-1-ylmethyl-...)
Affinity DataKi:  20nM. Assay description: Binding affinity was determined against Dopamine receptor D2 using [3H]spiperone
In DepthDetails ArticlePubMed
Target5-hydroxytryptamine receptor 1A(Rattus norvegicus (rat))
R. W. Johnson Pharmaceutical Research Institute
Curated by ChEMBL
LigandPNGBDBM50029298(1-(2-Isopropoxy-phenyl)-4-(3-piperidin-1-ylmethyl-...)
Affinity DataKi:  41nM. Assay description: Affinity against the 5-hydroxytryptamine receptor 1A using [3H]WB-4101.
In DepthDetails ArticlePubMed