BDBM50029308 1-{3-[4-(2-Isopropoxy-phenyl)-piperazin-1-ylmethyl]-phenyl}-ethanol::CHEMBL341402
SMILES CC(C)Oc1ccccc1N1CCN(Cc2cccc(c2)C(C)O)CC1
InChI Key InChIKey=SVCXFQYPKFXEAC-UHFFFAOYSA-N
Data  2 KI
  Tab Delimited (TSV)   2D SDfile   Computed 3D by Vconf -m prep SDfile
Find this compound or compounds like it in BindingDB:
Activity Spreadsheet -- Enzyme Inhibition Constant Data from BindingDB
Found 2 hits for monomerid = 50029308
Target5-hydroxytryptamine receptor 1A(Rattus norvegicus (rat))
R. W. Johnson Pharmaceutical Research Institute
Curated by ChEMBL
LigandPNGBDBM50029308(1-{3-[4-(2-Isopropoxy-phenyl)-piperazin-1-ylmethyl...)
Affinity DataKi:  25nM. Assay description: Affinity against the 5-hydroxytryptamine receptor 1A using [3H]WB-4101.
In DepthDetails ArticlePubMed
TargetD(2) dopamine receptor(Rattus norvegicus (rat))
R. W. Johnson Pharmaceutical Research Institute
Curated by ChEMBL
LigandPNGBDBM50029308(1-{3-[4-(2-Isopropoxy-phenyl)-piperazin-1-ylmethyl...)
Affinity DataKi:  56nM. Assay description: Affinity against the dopamine receptor D2 using [3H]spiperinone.
In DepthDetails ArticlePubMed