BDBM50029357 4-Amino-2-aminomethyl-2,3-dimethyl-butyric acid::CHEMBL137190
SMILES CC(CN)C(C)(CN)C(O)=O
InChI Key InChIKey=XGOZVHUIUUBBPX-UHFFFAOYSA-N
Data  1 KI
  Tab Delimited (TSV)   2D SDfile   Computed 3D by Vconf -m prep SDfile
Find this compound or compounds like it in BindingDB:
Activity Spreadsheet -- Enzyme Inhibition Constant Data from BindingDB
Found 1 hit for monomerid = 50029357
TargetOrnithine decarboxylase(Rattus norvegicus)
Universidad De Buenos Aires
Curated by ChEMBL
LigandPNGBDBM50029357(4-Amino-2-aminomethyl-2,3-dimethyl-butyric acid | ...)
Affinity DataKi:  1.65E+6nM. Assay description: Inhibition of liver Ornithine decarboxylase in thioacetamide-treated rat
In DepthDetails ArticlePubMed