BDBM50029719 2-(1,6-Dimethyl-2-oxo-1,2-dihydro-pyridin-4-yloxymethyl)-4-isopropyl-6-methoxy-1,1-dioxo-1,2-dihydro-1lambda*6*-benzo[d]isothiazol-3-one::CHEMBL143425
SMILES COc1cc2c(C(=O)N(COc3cc(C)n(C)c(=O)c3)S2(=O)=O)c(c1)C(C)C
InChI Key InChIKey=CDLMNXRBIKEYJH-UHFFFAOYSA-N
Data  1 KI
  Tab Delimited (TSV)   2D SDfile   Computed 3D by Vconf -m prep SDfile
Find this compound or compounds like it in BindingDB:
Activity Spreadsheet -- Enzyme Inhibition Constant Data from BindingDB
Found 1 hit for monomerid = 50029719
TargetNeutrophil elastase(Homo sapiens (Human))
Sterling Winthrop Pharmaceuticals Research Division
Curated by ChEMBL
LigandPNGBDBM50029719(2-(1,6-Dimethyl-2-oxo-1,2-dihydro-pyridin-4-yloxym...)
Affinity DataKi:  0.850nM. Assay description: Potency of inhibition of human leukocyte elastase is expressed as apparent binding constant
In DepthDetails ArticlePubMed