BDBM50029892 2-{4-Butyl-2-methyl-6-oxo-5-[2'-(1H-tetrazol-5-yl)-biphenyl-4-ylmethyl]-6H-pyrimidin-1-ylmethyl}-thiophene-3-carboxylic acid::CHEMBL144856
SMILES CCCCc1nc(C)n(Cc2sccc2C(O)=O)c(=O)c1Cc1ccc(cc1)-c1ccccc1-c1nnn[nH]1
InChI Key InChIKey=YLEBPLPGLHMFBO-UHFFFAOYSA-N
Data  1 KI
  Tab Delimited (TSV)   2D SDfile   Computed 3D by Vconf -m prep SDfile
Find this compound or compounds like it in BindingDB:
Activity Spreadsheet -- Enzyme Inhibition Constant Data from BindingDB
Found 1 hit for monomerid = 50029892
TargetType-1 angiotensin II receptor(Bos taurus)
Istituto Lusofarmaco
Curated by ChEMBL
LigandPNGBDBM50029892(2-{4-Butyl-2-methyl-6-oxo-5-[2'-(1H-tetrazol-5-yl)...)
Affinity DataKi: >4nM. Assay description: Binding affinity towards Angiotensin II type 2 receptor in bovine cerebellar cortical membranes; Inactive
In DepthDetails ArticlePubMed