BDBM50029909 4'-[4-Butyl-1-(2-carboxy-benzyl)-6-oxo-1,6-dihydro-pyrimidin-5-ylmethyl]-biphenyl-2-carboxylic acid::CHEMBL145249
SMILES CCCCc1ncn(Cc2ccccc2C(O)=O)c(=O)c1Cc1ccc(cc1)-c1ccccc1C(O)=O
InChI Key InChIKey=NEBXGWWOHIZFQL-UHFFFAOYSA-N
Data  1 KI
  Tab Delimited (TSV)   2D SDfile   Computed 3D by Vconf -m prep SDfile
Find this compound or compounds like it in BindingDB:
Activity Spreadsheet -- Enzyme Inhibition Constant Data from BindingDB
Found 1 hit for monomerid = 50029909
TargetType-1 angiotensin II receptor(Bos taurus)
Istituto Lusofarmaco
Curated by ChEMBL
LigandPNGBDBM50029909(4'-[4-Butyl-1-(2-carboxy-benzyl)-6-oxo-1,6-dihydro...)
Affinity DataKi: >4nM. Assay description: Binding affinity towards Angiotensin II type 2 receptor in bovine cerebellar cortical membranes; Inactive
In DepthDetails ArticlePubMed