BDBM50029927 2-[1-(1-Benzyl-piperidin-4-yl)-meth-(Z)-ylidene]-5,6-dimethoxy-indan-1-one; hydrochloride::CHEMBL555107
SMILES COc1cc2C\C(=C\C3CCN(Cc4ccccc4)CC3)C(=O)c2cc1OC
InChI Key InChIKey=LPMOTUSFDTTWJL-NDENLUEZSA-N
Data  1 IC50
  Tab Delimited (TSV)   2D SDfile   Computed 3D by Vconf -m prep SDfile
Find this compound or compounds like it in BindingDB:
Activity Spreadsheet -- Enzyme Inhibition Constant Data from BindingDB
Found 1 hit for monomerid = 50029927
TargetAcetylcholinesterase(Mus musculus (mouse))
Eisai
Curated by ChEMBL
LigandPNGBDBM50029927(2-[1-(1-Benzyl-piperidin-4-yl)-meth-(Z)-ylidene]-5...)
Affinity DataIC50:  13nM. Assay description: Inhibitory activity against acetylcholinesterase
In DepthDetails ArticlePubMed