BDBM50029936 2-(1-Benzyl-piperidin-4-ylmethyl)-4,5-dimethoxy-indan-1-one; hydrochloride::CHEMBL555827
SMILES COc1ccc2C(=O)C(CC3CCN(Cc4ccccc4)CC3)Cc2c1OC
InChI Key InChIKey=IYXLMUZIMXFFNL-UHFFFAOYSA-N
Data  1 IC50
  Tab Delimited (TSV)   2D SDfile   Computed 3D by Vconf -m prep SDfile
Find this compound or compounds like it in BindingDB:
Activity Spreadsheet -- Enzyme Inhibition Constant Data from BindingDB
Found 1 hit for monomerid = 50029936
TargetAcetylcholinesterase(Mus musculus (mouse))
Eisai
Curated by ChEMBL
LigandPNGBDBM50029936(2-(1-Benzyl-piperidin-4-ylmethyl)-4,5-dimethoxy-in...)
Affinity DataIC50:  20nM. Assay description: Inhibitory activity against acetylcholinesterase
In DepthDetails ArticlePubMed