BDBM50030010 ((S)-8-Methoxy-1,2,3,4-tetrahydro-naphthalen-2-yl)-dipropyl-amine::((S)-8-Methoxy-1,2,3,4-tetrahydro-naphthalen-2-yl)-dipropyl-ammonium::(8-Methoxy-1,2,3,4-tetrahydro-naphthalen-2-yl)-dipropyl-amine::CHEMBL315684
SMILES CCCN(CCC)[C@H]1CCc2cccc(OC)c2C1
InChI Key InChIKey=SPOMVKJPPZWHRF-HNNXBMFYSA-N
Data  3 KI
  Tab Delimited (TSV)   2D SDfile   Computed 3D by Vconf -m prep SDfile
Find this compound or compounds like it in BindingDB:
Activity Spreadsheet -- Enzyme Inhibition Constant Data from BindingDB
Found 3 hits for monomerid = 50030010
Target5-hydroxytryptamine receptor 1A(Rattus norvegicus (rat))
Uppsala University
Curated by ChEMBL
LigandPNGBDBM50030010(((S)-8-Methoxy-1,2,3,4-tetrahydro-naphthalen-2-yl)...)
Affinity DataKi:  2.80nM. Assay description: Binding affinity of 5-hydroxytryptamine 1A receptor using [3H]-8-OH-DPAT as radioligand.
In DepthDetails ArticlePubMed
Target5-hydroxytryptamine receptor 1A(Rattus norvegicus (rat))
Uppsala University
Curated by ChEMBL
LigandPNGBDBM50030010(((S)-8-Methoxy-1,2,3,4-tetrahydro-naphthalen-2-yl)...)
Affinity DataKi:  2.80nM. Assay description: Inhibition of [3H]- 8-OH-DPAT binding to 5-HT1A-receptor from rat cerebral cortex membranes
In DepthDetails Article
Target5-hydroxytryptamine receptor 7(Rattus norvegicus (rat))
State University Of Groningen
Curated by ChEMBL
LigandPNGBDBM50030010(((S)-8-Methoxy-1,2,3,4-tetrahydro-naphthalen-2-yl)...)
Affinity DataKi:  339nM. Assay description: Binding affinity at rat 5-hydroxytryptamine 7 receptor.
In DepthDetails ArticlePubMed