BDBM50030065 Ac-C-N-P-R-G-D-(Y-OMe)-Cit-C-NH2::CHEMBL2371503
SMILES [H][C@@]12[#6]-[#6]-[#6]-[#7]1-[#6](=O)-[#6@@H](-[#6]-[#6](-[#7])=O)-[#7]-[#6](=O)-[#6@H](-[#6]-[#16]-[#16]-[#6]-[#6@H](-[#7]-[#6](=O)-[#6@H](-[#6]-[#6]-[#6]-[#7]-[#6](-[#7])=O)-[#7]-[#6](=O)-[#6@H](-[#6]-c1ccc(-[#8]-[#6])cc1)-[#7]-[#6](=O)-[#6@@H](-[#6]-[#6](-[#8])=O)-[#7]-[#6](=O)-[#6]-[#7]-[#6](=O)-[#6@@H](-[#6]-[#6]-[#6]\[#7]=[#6](\[#7])-[#7])-[#7]-[#6]2=O)-[#6](-[#7])=O)-[#7]-[#6](-[#6])=O
InChI Key InChIKey=NYBIVSZISCEEHW-MWHDYBBUSA-N
Data  3 IC50
  Tab Delimited (TSV)   2D SDfile   Computed 3D by Vconf -m prep SDfile
Find this compound or compounds like it in BindingDB:
Activity Spreadsheet -- Enzyme Inhibition Constant Data from BindingDB
Found 3 hits for monomerid = 50030065
TargetIntegrin alpha-IIb/beta-3(Homo sapiens (Human))
Telios Pharmaceuticals
Curated by ChEMBL
LigandPNGBDBM50030065(Ac-C-N-P-R-G-D-(Y-OMe)-Cit-C-NH2 | CHEMBL2371503)
Affinity DataIC50:  440nM. Assay description: Binding affinity against integrin alpha 2b-beta 3 in enzyme linked immunosorbent assay (ELISA)
In DepthDetails ArticlePubMed
TargetIntegrin alpha-5/beta-1(Homo sapiens (Human))
Telios Pharmaceuticals
Curated by ChEMBL
LigandPNGBDBM50030065(Ac-C-N-P-R-G-D-(Y-OMe)-Cit-C-NH2 | CHEMBL2371503)
Affinity DataIC50:  440nM. Assay description: Binding affinity against integrin alpha5-beta1 in enzyme linked immunosorbent assay (ELISA)
In DepthDetails ArticlePubMed
TargetIntegrin alpha-V/beta-5(Homo sapiens (Human))
Telios Pharmaceuticals
Curated by ChEMBL
LigandPNGBDBM50030065(Ac-C-N-P-R-G-D-(Y-OMe)-Cit-C-NH2 | CHEMBL2371503)
Affinity DataIC50:  440nM. Assay description: Binding affinity against integrin alpha V-beta5 in enzyme linked immunosorbent assay (ELISA)
In DepthDetails ArticlePubMed