BDBM50030329 CHEMBL3343839
SMILES CC12CC3(C)CC(O)(C1)CC(C2)(C3)NC(=O)CCn1sc2cccc(F)c2c1=O
InChI Key InChIKey=KLORHPCJGQECSK-UHFFFAOYSA-N
Data  1 IC50
  Tab Delimited (TSV)   2D SDfile   Computed 3D by Vconf -m prep SDfile
Find this compound or compounds like it in BindingDB:
Activity Spreadsheet -- Enzyme Inhibition Constant Data from BindingDB
Found 1 hit for monomerid = 50030329
TargetSortase family protein(Staphylococcus aureus)
University Of Latvia
Curated by ChEMBL
LigandPNGBDBM50030329(CHEMBL3343839)
Affinity DataIC50:  3.96E+3nM. Assay description: Inhibition of Staphylococcus aureus sortase A using dabcyl-QALPETGEE-edans as substrate incubated for 1 hr prior to substrate addition measured at 1 ...
In DepthDetails ArticlePubMed