BDBM50030337 CHEMBL3343843
SMILES Fc1cccc2sn(CCC(=O)NNC(=O)C34CC5CC(CC(C5)C3)C4)c(=O)c12
InChI Key InChIKey=APWQEHXONFBVFY-UHFFFAOYSA-N
Data  1 IC50
  Tab Delimited (TSV)   2D SDfile   Computed 3D by Vconf -m prep SDfile
Find this compound or compounds like it in BindingDB:
Activity Spreadsheet -- Enzyme Inhibition Constant Data from BindingDB
Found 1 hit for monomerid = 50030337
TargetSortase family protein(Staphylococcus aureus)
University Of Latvia
Curated by ChEMBL
LigandPNGBDBM50030337(CHEMBL3343843)
Affinity DataIC50:  3.39E+3nM. Assay description: Inhibition of Staphylococcus aureus sortase A using dabcyl-QALPETGEE-edans as substrate incubated for 1 hr prior to substrate addition measured at 1 ...
In DepthDetails ArticlePubMed