BDBM50030434 5-Dimethylamino-pentanoic acid [(S)-4-(3,5-bis-trifluoromethyl-phenyl)-1-(1H-indol-3-ylmethyl)-2-oxo-butyl]-amide::CHEMBL120081
SMILES CN(C)CCCCC(=O)N[C@@H](Cc1c[nH]c2ccccc12)C(=O)CCc1cc(cc(c1)C(F)(F)F)C(F)(F)F
InChI Key InChIKey=ZJEJBRMLBWRVFN-DEOSSOPVSA-N
Data  2 IC50
  Tab Delimited (TSV)   2D SDfile   Computed 3D by Vconf -m prep SDfile
Find this compound or compounds like it in BindingDB:
Activity Spreadsheet -- Enzyme Inhibition Constant Data from BindingDB
Found 2 hits for monomerid = 50030434
TargetSubstance-P receptor(Homo sapiens (Human))
Washington University
Curated by ChEMBL
LigandPNGBDBM50030434(5-Dimethylamino-pentanoic acid [(S)-4-(3,5-bis-tri...)
Affinity DataIC50:  0.603nM. Assay description: Binding affinity was measured against the Tachykinin receptor 1 in CHO-expressed hNK1 using [125I]SP.
In DepthDetails ArticlePubMed
TargetSubstance-P receptor(Homo sapiens (Human))
Washington University
Curated by ChEMBL
LigandPNGBDBM50030434(5-Dimethylamino-pentanoic acid [(S)-4-(3,5-bis-tri...)
Affinity DataIC50:  0.600nM. Assay description: Binding affinity against human Tachykinin receptor 1 expressed in CHO cells was measured by its ability to displace [125I]- Tyr-8 substance P.
In DepthDetails ArticlePubMed