BDBM50030686 CHEMBL338433::N-{3-[3-Butyl-4-(3-fluoro-2'-(N-t-butyloxycarbonyl)-Sulfanamido-biphenyl-4-ylmethyl)-5-oxo-4,5-dihydro-[1,2,4]triazol-1-yl]-4-trifluoromethyl-phenyl}-2-ethoxy-acetamide
SMILES CCCCc1nn(-c2cc(NC(=O)COCC)ccc2C(F)(F)F)c(=O)n1Cc1ccc(cc1F)-c1ccccc1S(=O)(=O)NC(=O)OC(C)(C)C
InChI Key InChIKey=QNOCHXNNNZISSR-UHFFFAOYSA-N
Data  7 IC50
  Tab Delimited (TSV)   2D SDfile   Computed 3D by Vconf -m prep SDfile
Find this compound or compounds like it in BindingDB:
Activity Spreadsheet -- Enzyme Inhibition Constant Data from BindingDB
Found 7 hits for monomerid = 50030686
TargetType-2 angiotensin II receptor(RAT)
Merck Research Laboratories
Curated by ChEMBL
LigandPNGBDBM50030686(CHEMBL338433 | N-{3-[3-Butyl-4-(3-fluoro-2'-(N-t-b...)
Affinity DataIC50:  0.230nM. Assay description: In vitro inhibitory activity against Angiotensin II receptor, type 2 in rat midbrain membrane preparations.
In DepthDetails ArticlePubMed
TargetType-1 angiotensin II receptor(RABBIT)
Merck Research Laboratories
Curated by ChEMBL
LigandPNGBDBM50030686(CHEMBL338433 | N-{3-[3-Butyl-4-(3-fluoro-2'-(N-t-b...)
Affinity DataIC50:  0.260nM. Assay description: In vitro inhibitory activity against Angiotensin II receptor, type 1 in rabbit aorta membrane preparations.
In DepthDetails ArticlePubMed
TargetType-1 angiotensin II receptor(Homo sapiens (Human))
Merck Research Laboratories
Curated by ChEMBL
LigandPNGBDBM50030686(CHEMBL338433 | N-{3-[3-Butyl-4-(3-fluoro-2'-(N-t-b...)
Affinity DataIC50:  0.940nM. Assay description: In vitro inhibitory activity against angiotensin II receptor type 1, in human adrenal membrane preparations.
In DepthDetails ArticlePubMed
TargetType-1 angiotensin II receptor(RABBIT)
Merck Research Laboratories
Curated by ChEMBL
LigandPNGBDBM50030686(CHEMBL338433 | N-{3-[3-Butyl-4-(3-fluoro-2'-(N-t-b...)
Affinity DataIC50:  0.260nM. Assay description: Antagonist activity at Oryctolagus cuniculus (rabbit) aortic AT1 receptor
In DepthDetails Article
TargetType-2 angiotensin II receptor(Homo sapiens (Human))
Merck Research Laboratories
Curated by ChEMBL
LigandPNGBDBM50030686(CHEMBL338433 | N-{3-[3-Butyl-4-(3-fluoro-2'-(N-t-b...)
Affinity DataIC50:  2.20nM. Assay description: In vitro inhibitory activity against Angiotensin II receptor type 2 in human adrenal membrane preparations.
In DepthDetails ArticlePubMed
TargetType-1 angiotensin II receptor(RABBIT)
Merck Research Laboratories
Curated by ChEMBL
LigandPNGBDBM50030686(CHEMBL338433 | N-{3-[3-Butyl-4-(3-fluoro-2'-(N-t-b...)
Affinity DataIC50:  0.260nM. Assay description: Antagonist activity at Oryctolagus cuniculus (rabbit) aortic AT1 receptor
In DepthDetails Article
TargetType-2 angiotensin II receptor(RAT)
Merck Research Laboratories
Curated by ChEMBL
LigandPNGBDBM50030686(CHEMBL338433 | N-{3-[3-Butyl-4-(3-fluoro-2'-(N-t-b...)
Affinity DataIC50:  0.170nM. Assay description: In vitro inhibitory activity against angiotensin II type 2 receptor in rat adrenal membrane preparations.
In DepthDetails ArticlePubMed