BDBM50030723 CHEMBL122157::N-{4-Bromo-3-[3-ethyl-4-(3-fluoro-2'-(N-t-butyloxycarbonyl)-Sulfanamido-biphenyl-4-ylmethyl)-5-oxo-4,5-dihydro-[1,2,4]triazol-1-yl]-phenyl}-propionamide
SMILES CCC(=O)Nc1ccc(Br)c(c1)-n1nc(CC)n(Cc2ccc(cc2F)-c2ccccc2S(=O)(=O)NC(=O)OC(C)(C)C)c1=O
InChI Key InChIKey=ARZSHBUQUYOQDP-UHFFFAOYSA-N
Data  7 IC50
  Tab Delimited (TSV)   2D SDfile   Computed 3D by Vconf -m prep SDfile
Find this compound or compounds like it in BindingDB:
Activity Spreadsheet -- Enzyme Inhibition Constant Data from BindingDB
Found 7 hits for monomerid = 50030723
TargetType-1 angiotensin II receptor(RABBIT)
Merck Research Laboratories
Curated by ChEMBL
LigandPNGBDBM50030723(CHEMBL122157 | N-{4-Bromo-3-[3-ethyl-4-(3-fluoro-2...)
Affinity DataIC50:  0.560nM. Assay description: In vitro inhibitory activity against Angiotensin II receptor, type 1 in rabbit aorta membrane preparations.
In DepthDetails ArticlePubMed
TargetType-2 angiotensin II receptor(RAT)
Merck Research Laboratories
Curated by ChEMBL
LigandPNGBDBM50030723(CHEMBL122157 | N-{4-Bromo-3-[3-ethyl-4-(3-fluoro-2...)
Affinity DataIC50:  0.480nM. Assay description: In vitro inhibitory activity against Angiotensin II receptor, type 2 in rat midbrain membrane preparations.
In DepthDetails ArticlePubMed
TargetType-1 angiotensin II receptor(Homo sapiens (Human))
Merck Research Laboratories
Curated by ChEMBL
LigandPNGBDBM50030723(CHEMBL122157 | N-{4-Bromo-3-[3-ethyl-4-(3-fluoro-2...)
Affinity DataIC50:  0.560nM. Assay description: In vitro inhibitory activity against Angiotensin II receptor, type 1 in rabbit aorta membrane preparations.
In DepthDetails ArticlePubMed
TargetType-1 angiotensin II receptor(RABBIT)
Merck Research Laboratories
Curated by ChEMBL
LigandPNGBDBM50030723(CHEMBL122157 | N-{4-Bromo-3-[3-ethyl-4-(3-fluoro-2...)
Affinity DataIC50:  0.560nM. Assay description: Antagonist activity at Oryctolagus cuniculus (rabbit) aortic AT1 receptor
In DepthDetails Article
TargetType-2 angiotensin II receptor(Homo sapiens (Human))
Merck Research Laboratories
Curated by ChEMBL
LigandPNGBDBM50030723(CHEMBL122157 | N-{4-Bromo-3-[3-ethyl-4-(3-fluoro-2...)
Affinity DataIC50:  1.70nM. Assay description: In vitro inhibitory activity against Angiotensin II receptor type 2 in human adrenal membrane preparations.
In DepthDetails ArticlePubMed
TargetType-1 angiotensin II receptor(RABBIT)
Merck Research Laboratories
Curated by ChEMBL
LigandPNGBDBM50030723(CHEMBL122157 | N-{4-Bromo-3-[3-ethyl-4-(3-fluoro-2...)
Affinity DataIC50:  0.561nM. Assay description: Antagonist activity at Oryctolagus cuniculus (rabbit) aortic AT1 receptor
In DepthDetails Article
TargetType-2 angiotensin II receptor(RAT)
Merck Research Laboratories
Curated by ChEMBL
LigandPNGBDBM50030723(CHEMBL122157 | N-{4-Bromo-3-[3-ethyl-4-(3-fluoro-2...)
Affinity DataIC50:  1.10nM. Assay description: In vitro inhibitory activity against angiotensin II type 2 receptor in rat adrenal membrane preparations.
In DepthDetails ArticlePubMed