BDBM50030738 CHEMBL3342122
SMILES COCCOC(=O)c1c(C)nc2sc(C(=O)c3ccc(OC)cc3)c(N)c2c1-c1ccc(OC)cc1
InChI Key InChIKey=SOSSYGGWFZTDLJ-UHFFFAOYSA-N
Data  1 EC50
  Tab Delimited (TSV)   2D SDfile   Computed 3D by Vconf -m prep SDfile
Find this compound or compounds like it in BindingDB:
Activity Spreadsheet -- Enzyme Inhibition Constant Data from BindingDB
Found 1 hit for monomerid = 50030738
TargetBroad substrate specificity ATP-binding cassette transporter ABCG2(Homo sapiens (Human))
Institute Of Organic Synthesis
Curated by ChEMBL
LigandPNGBDBM50030738(CHEMBL3342122)
Affinity DataEC50:  800nM. Assay description: Modulation of BCRP1 mediated drug efflux in mitoxantrone-resistant human MES-SA cells assessed as accumulation of hoechst 33342 incubated for 15 mins...
In DepthDetails ArticlePubMed