BDBM50030780 CHEMBL3342373
SMILES CNc1nc(NC2(CCC2)c2ccc(Cl)cc2)cc(n1)-c1ccccn1
InChI Key InChIKey=PLBKMJDLCJIFHY-UHFFFAOYSA-N
Data  2 EC50
  Tab Delimited (TSV)   2D SDfile   Computed 3D by Vconf -m prep SDfile
Find this compound or compounds like it in BindingDB:
Activity Spreadsheet -- Enzyme Inhibition Constant Data from BindingDB
Found 2 hits for monomerid = 50030780
TargetG-protein coupled receptor 39(Mus musculus)
Novartis Institutes For Biomedical Research
Curated by ChEMBL
LigandPNGBDBM50030780(CHEMBL3342373)
Affinity DataEC50:  34nM. Assay description: Agonist activity at mouse GPR39 expressed in HEK293 cells by IP1 assay
In DepthDetails ArticlePubMed
TargetG-protein coupled receptor 39(Homo sapiens (Human))
Novartis Institutes For Biomedical Research
Curated by ChEMBL
LigandPNGBDBM50030780(CHEMBL3342373)
Affinity DataEC50:  25nM. Assay description: Agonist activity at human GPR39 expressed in HEK293 cells by IP1 assay
In DepthDetails ArticlePubMed