BDBM50030869 CHEMBL3342581
SMILES COc1ccc(cc1)-c1c(NC(C)=O)onc1-c1cc(Cl)c(O)cc1O
InChI Key InChIKey=ZPXWZHXHEMSPJU-UHFFFAOYSA-N
Data  1 IC50
PDB links: 1 PDB ID matches this monomer.
  Tab Delimited (TSV)   2D SDfile   Computed 3D by Vconf -m prep SDfile
Find this compound or compounds like it in BindingDB:
Activity Spreadsheet -- Enzyme Inhibition Constant Data from BindingDB
Found 1 hit for monomerid = 50030869
TargetHeat shock protein HSP 90-alpha(Homo sapiens (Human))
Chinese Academy Of Sciences
Curated by ChEMBL
LigandPNGBDBM50030869(CHEMBL3342581)
Affinity DataIC50:  70nM. Assay description: Inhibition of HSP90alpha (unknown origin) after 16 hrs by FP enzymatic assay