BDBM50030892 DIHYDROGUAIARETIC ACID
SMILES COc1cc(CC(C)C(C)Cc2ccc(O)c(OC)c2)ccc1O
InChI Key InChIKey=ADFOLUXMYYCTRR-UHFFFAOYSA-N
Data  1 EC50
PDB links: 1 PDB ID matches this monomer.
  Tab Delimited (TSV)   2D SDfile   Computed 3D by Vconf -m prep SDfile
Find this compound or compounds like it in BindingDB:
Activity Spreadsheet -- Enzyme Inhibition Constant Data from BindingDB
Found 1 hit for monomerid = 50030892
TargetTransthyretin(Homo sapiens (Human))
University Of Toyama
Curated by ChEMBL
LigandPNGBDBM50030892(DIHYDROGUAIARETIC ACID)
Affinity DataEC50:  6.30E+3nM. Assay description: Inhibition of TTR V30M mutant (unknown origin) expressed in Escherichia coli assessed as inhibition of amyloid fibril formation by fluorescence assay