BDBM50031226 (S)-3-[2-({(S)-2-[(S)-2-((S)-2-{(R)-2-[(S)-2-Amino-3-(4-hydroxy-phenyl)-propionylamino]-4-methylsulfanyl-butyrylamino}-3-phenyl-propionylamino)-3-(3H-imidazol-4-yl)-propionylamino]-4-methyl-pentanoyl}-butyl-amino)-acetylamino]-succinamic acid::CHEMBL340919
SMILES CCCCN(CC(=O)N[C@@H](CC(O)=O)C(N)=O)C(=O)[C@H](CC(C)C)NC(=O)[C@H](Cc1cnc[nH]1)NC(=O)[C@H](Cc1ccccc1)NC(=O)[C@@H](CCSC)NC(=O)[C@@H](N)Cc1ccc(O)cc1
InChI Key InChIKey=UTLROTXPFCUVES-PQVJJDQFSA-N
Data  2 KI
  Tab Delimited (TSV)   2D SDfile   Computed 3D by Vconf -m prep SDfile
Find this compound or compounds like it in BindingDB:
Activity Spreadsheet -- Enzyme Inhibition Constant Data from BindingDB
Found 2 hits for monomerid = 50031226
TargetDelta-type opioid receptor(Rattus norvegicus (rat))
Tohoku College Of Pharmacy
Curated by ChEMBL
LigandPNGBDBM50031226((S)-3-[2-({(S)-2-[(S)-2-((S)-2-{(R)-2-[(S)-2-Amino...)
Affinity DataKi:  0.0400nM. Assay description: Inhibition of [3H]-DADLE binding to rat brain delta receptor
In DepthDetails ArticlePubMed
TargetMu-type opioid receptor(Rattus norvegicus (rat))
Tohoku College Of Pharmacy
Curated by ChEMBL
LigandPNGBDBM50031226((S)-3-[2-({(S)-2-[(S)-2-((S)-2-{(R)-2-[(S)-2-Amino...)
Affinity DataKi:  820nM. Assay description: Inhibition of [3H]-DAGO binding to rat brain Opioid receptor mu 1
In DepthDetails ArticlePubMed