BDBM50031250 (R)-2-{2-[(R)-2-((S)-5-{(S)-2-[(S)-2-((S)-2-Acetylamino-5-guanidino-pentanoylamino)-3-methyl-butyrylamino]-6-amino-hexanoylamino}-8-guanidino-4-oxo-octanoylamino)-3-methyl-butyrylamino]-acetylamino}-4-methyl-pentanoic acid methyl ester::CHEMBL337198
SMILES COC(=O)[C@@H](CC(C)C)NC(=O)CNC(=O)[C@H](NC(=O)CCC(=O)[C@H](CCCNC(N)=N)NC(=O)[C@H](CCCCN)NC(=O)[C@@H](NC(=O)[C@H](CCCNC(N)=N)NC(C)=O)C(C)C)C(C)C
InChI Key InChIKey=SNTCAOUIVXOIOW-XFQPNXORSA-N
Data  1 KI
  Tab Delimited (TSV)   2D SDfile   Computed 3D by Vconf -m prep SDfile
Find this compound or compounds like it in BindingDB:
Activity Spreadsheet -- Enzyme Inhibition Constant Data from BindingDB
Found 1 hit for monomerid = 50031250
TargetFurin(Homo sapiens (Human))
Friedrich Miescher-Institut
Curated by ChEMBL
LigandPNGBDBM50031250((R)-2-{2-[(R)-2-((S)-5-{(S)-2-[(S)-2-((S)-2-Acetyl...)
Affinity DataKi:  350nM. Assay description: Inhibitory activity of the compound against furin
In DepthDetails ArticlePubMed