BDBM50031595 CHEMBL3359187
SMILES COC[C@@H]1CCCN1S(=O)(=O)c1cc2C(=O)C(=O)N(CCCF)c2c(I)c1
InChI Key InChIKey=XFDDCMWVWGKTPZ-NSHDSACASA-N
Data  4 IC50
  Tab Delimited (TSV)   2D SDfile   Computed 3D by Vconf -m prep SDfile
Find this compound or compounds like it in BindingDB:
Activity Spreadsheet -- Enzyme Inhibition Constant Data from BindingDB
Found 4 hits for monomerid = 50031595
TargetCaspase-7(Homo sapiens (Human))
Westf£Lische Wilhelms-Universit£T M£Nster
Curated by ChEMBL
LigandPNGBDBM50031595(CHEMBL3359187)
Affinity DataIC50:  123nM. Assay description: Inhibition of human recombinant caspase 7 using Ac-DEVD-AMC substrate assessed as accumulation of cleaved fluorogenic product
In DepthDetails ArticlePubMed
TargetCaspase-6(Homo sapiens (Human))
Westf£Lische Wilhelms-Universit£T M£Nster
Curated by ChEMBL
LigandPNGBDBM50031595(CHEMBL3359187)
Affinity DataIC50:  2.85E+4nM. Assay description: Inhibition of human recombinant caspase 6 using Ac-VEID-AMC substrate assessed as accumulation of cleaved fluorogenic product
In DepthDetails ArticlePubMed
TargetCaspase-3(Homo sapiens (Human))
Westf£Lische Wilhelms-Universit£T M£Nster
Curated by ChEMBL
LigandPNGBDBM50031595(CHEMBL3359187)
Affinity DataIC50:  20nM. Assay description: Inhibition of human recombinant caspase 3 using Ac-DEVD-AMC substrate assessed as accumulation of cleaved fluorogenic product
In DepthDetails ArticlePubMed
TargetCaspase-1(Homo sapiens (Human))
Westf£Lische Wilhelms-Universit£T M£Nster
Curated by ChEMBL
LigandPNGBDBM50031595(CHEMBL3359187)
Affinity DataIC50:  5.00E+5nM. Assay description: Inhibition of human recombinant caspase 1 using Ac-YVAD-AMC substrate assessed as accumulation of cleaved fluorogenic product
In DepthDetails ArticlePubMed