BDBM50031621 CHEMBL3359755
SMILES CC1(C)OCCC(=C1)c1cnc2Oc3ccc(cc3[C@@]3(COC(N)=N3)c2c1)-c1cccnc1F
InChI Key InChIKey=PVRPBUIVTLGNNB-SANMLTNESA-N
Data  1 KI  2 IC50
  Tab Delimited (TSV)   2D SDfile   Computed 3D by Vconf -m prep SDfile
Find this compound or compounds like it in BindingDB:
Activity Spreadsheet -- Enzyme Inhibition Constant Data from BindingDB
Found 3 hits for monomerid = 50031621
TargetPotassium voltage-gated channel subfamily H member 2(Homo sapiens (Human))
Amgen
Curated by ChEMBL
LigandPNGBDBM50031621(CHEMBL3359755)
Affinity DataKi: >1.00E+4nM. Assay description: Inhibition of human ERG channel expressed in HEK293 cells assessed as [3H]-dofetilide binding after 90 mins by liquid scintillation counting analysis
In DepthDetails ArticlePubMed
TargetBeta-secretase 1(Homo sapiens (Human))
Amgen
Curated by ChEMBL
LigandPNGBDBM50031621(CHEMBL3359755)
Affinity DataIC50:  0.900nM. Assay description: Inhibition of BACE1 (unknown origin) incubated for 60 mins prior to substrate addition measured after 60 mins by fluorescence assay
In DepthDetails ArticlePubMed
TargetBeta-secretase 1(Homo sapiens (Human))
Amgen
Curated by ChEMBL
LigandPNGBDBM50031621(CHEMBL3359755)
Affinity DataIC50:  6.60nM. Assay description: Inhibition of BACE1 in HEK293 cells assessed as Abeta40 level after overnight incubation by sandwich ELISA
In DepthDetails ArticlePubMed