BDBM50031755 CHEMBL3360325
SMILES COc1ccc(cc1)-c1cccc2nc(NC(=O)c3ccccc3)nn12
InChI Key InChIKey=XCUIKIYPUSLOMQ-UHFFFAOYSA-N
Data  1 IC50
  Tab Delimited (TSV)   2D SDfile   Computed 3D by Vconf -m prep SDfile
Find this compound or compounds like it in BindingDB:
Activity Spreadsheet -- Enzyme Inhibition Constant Data from BindingDB
Found 1 hit for monomerid = 50031755
TargetTyrosine-protein kinase JAK1(Homo sapiens (Human))
Galapagos
Curated by ChEMBL
LigandPNGBDBM50031755(CHEMBL3360325)
Affinity DataIC50: >1.00E+4nM. Assay description: Inhibition of human recombinant JAK1
In DepthDetails ArticlePubMed