BDBM50031788 (R)-N*4*-Hydroxy-2-(5-hydroxy-pentyl)-N*1*-((S)-1-methylcarbamoyl-2-phenyl-ethyl)-succinamide::(R)-N4-hydroxy-2-(5-hydroxypentyl)-N1-((S)-1-(methylamino)-1-oxo-3-phenylpropan-2-yl)succinamide::CHEMBL87046
SMILES CNC(=O)[C@H](Cc1ccccc1)NC(=O)[C@H](CCCCCO)CC(=O)NO
InChI Key InChIKey=HCELOWJRPJWTPO-CVEARBPZSA-N
Data  7 KI
  Tab Delimited (TSV)   2D SDfile   Computed 3D by Vconf -m prep SDfile
Find this compound or compounds like it in BindingDB:
Activity Spreadsheet -- Enzyme Inhibition Constant Data from BindingDB
Found 7 hits for monomerid = 50031788
TargetNeutrophil collagenase(Homo sapiens (Human))
TBA
Curated by ChEMBL
LigandPNGBDBM50031788((R)-N*4*-Hydroxy-2-(5-hydroxy-pentyl)-N*1*-((S)-1-...)
Affinity DataKi:  4nM. Assay description: Inhibition of human neutrophil collagenase, matrix metalloproteinase-8
In DepthDetails Article
TargetNeutrophil collagenase(Homo sapiens (Human))
TBA
Curated by ChEMBL
LigandPNGBDBM50031788((R)-N*4*-Hydroxy-2-(5-hydroxy-pentyl)-N*1*-((S)-1-...)
Affinity DataKi:  4nM. Assay description: Inhibition of human neutrophil collagenase(HNC), MMP-8
In DepthDetails ArticlePubMed
TargetInterstitial collagenase(Homo sapiens (Human))
Sterling Winthrop Pharmaceuticals Research Division
Curated by ChEMBL
LigandPNGBDBM50031788((R)-N*4*-Hydroxy-2-(5-hydroxy-pentyl)-N*1*-((S)-1-...)
Affinity DataKi:  31nM. Assay description: Inhibitory potency against human fibroblast collagenase, MMP-1
In DepthDetails ArticlePubMed
TargetInterstitial collagenase(Homo sapiens (Human))
Sterling Winthrop Pharmaceuticals Research Division
Curated by ChEMBL
LigandPNGBDBM50031788((R)-N*4*-Hydroxy-2-(5-hydroxy-pentyl)-N*1*-((S)-1-...)
Affinity DataKi:  31nM. Assay description: Inhibition of human fibroblast collagenase, matrix metalloproteinase-1
In DepthDetails Article
TargetStromelysin-1(Homo sapiens (Human))
Pomona College
Curated by ChEMBL
LigandPNGBDBM50031788((R)-N*4*-Hydroxy-2-(5-hydroxy-pentyl)-N*1*-((S)-1-...)
Affinity DataKi:  427nM. Assay description: Inhibition of MMP3
In DepthDetails ArticlePubMed
TargetStromelysin-1(Homo sapiens (Human))
Pomona College
Curated by ChEMBL
LigandPNGBDBM50031788((R)-N*4*-Hydroxy-2-(5-hydroxy-pentyl)-N*1*-((S)-1-...)
Affinity DataKi:  430nM. Assay description: Inhibition of human fibroblast stromelysin, matrix metalloproteinase-3
In DepthDetails Article
TargetStromelysin-1(Homo sapiens (Human))
Pomona College
Curated by ChEMBL
LigandPNGBDBM50031788((R)-N*4*-Hydroxy-2-(5-hydroxy-pentyl)-N*1*-((S)-1-...)
Affinity DataKi:  430nM. Assay description: Inhibitory potency against human stromelysin, MMP-3
In DepthDetails ArticlePubMed