BDBM50031845 (4-Biphenyl-4-yl-1-phosphono-butyl)-phosphonic acid::BPH-674::CHEMBL87292
SMILES OP(O)(=O)C(CCCc1ccc(cc1)-c1ccccc1)P(O)(O)=O
InChI Key InChIKey=UQVFFWAGEQWWMP-UHFFFAOYSA-N
Data  3 IC50
  Tab Delimited (TSV)   2D SDfile   Computed 3D by Vconf -m prep SDfile
Find this compound or compounds like it in BindingDB:
Activity Spreadsheet -- Enzyme Inhibition Constant Data from BindingDB
Found 3 hits for monomerid = 50031845
TargetDecaprenyl diphosphate synthase(Mycobacterium tuberculosis H37Rv)
University Of California San Diego
LigandPNGBDBM50031845((4-Biphenyl-4-yl-1-phosphono-butyl)-phosphonic aci...)
Affinity DataIC50:  1.60E+3nMpH: 7.5Assay Description:We screened an in-house library of 53 compounds using trans-FPP as substrate. Briefly, the condensation of IPP and GPP, FPP, or cis-FPP catalyzed by ...
In DepthDetails ArticlePubMed
TargetSqualene synthase(Rattus norvegicus)
Bristol-Myers Squibb Pharmaceutical Research Institute
Curated by ChEMBL
LigandPNGBDBM50031845((4-Biphenyl-4-yl-1-phosphono-butyl)-phosphonic aci...)
Affinity DataIC50:  0.700nM. Assay description: Inhibitory activity against rat liver microsomal squalene synthase was determined using [3H]-FPP as radioligand
In DepthDetails ArticlePubMed
TargetSqualene synthase(Rattus norvegicus)
Bristol-Myers Squibb Pharmaceutical Research Institute
Curated by ChEMBL
LigandPNGBDBM50031845((4-Biphenyl-4-yl-1-phosphono-butyl)-phosphonic aci...)
Affinity DataIC50:  0.700nM. Assay description: Inhibition rat liver microsomal squalene synthase
In DepthDetails ArticlePubMed