BDBM50031848 ((E)-7,11-Dimethyl-1-phosphono-dodeca-6,10-dienyl)-phosphonic acid::CHEMBL88304
SMILES [#6]\[#6](-[#6])=[#6]/[#6]-[#6]\[#6](-[#6])=[#6]\[#6]-[#6]-[#6]-[#6]-[#6](P([#8])([#8])=O)P([#8])([#8])=O
InChI Key InChIKey=JCYZSGYSCXRCHX-UKTHLTGXSA-N
Data  1 IC50
  Tab Delimited (TSV)   2D SDfile   Computed 3D by Vconf -m prep SDfile
Find this compound or compounds like it in BindingDB:
Activity Spreadsheet -- Enzyme Inhibition Constant Data from BindingDB
Found 1 hit for monomerid = 50031848
TargetSqualene synthase(Rattus norvegicus)
Bristol-Myers Squibb Pharmaceutical Research Institute
Curated by ChEMBL
LigandPNGBDBM50031848(((E)-7,11-Dimethyl-1-phosphono-dodeca-6,10-dienyl)...)
Affinity DataIC50:  2.60nM. Assay description: Inhibition rat liver microsomal squalene synthase
In DepthDetails ArticlePubMed