BDBM50031964 3-[(5-Ethyl-pyrazolo[1,5-a]pyrimidin-7-ylamino)-methyl]-11-(1H-tetrazol-5-yl)-dibenzo[a,d]cyclohepten-5-one::CHEMBL90513
SMILES CCc1cc(NCc2ccc3c(cc4ccccc4c(=O)c3c2)-c2nnn[nH]2)n2nccc2n1
InChI Key InChIKey=ANIKSCLODKRPIM-UHFFFAOYSA-N
Data  1 KI
  Tab Delimited (TSV)   2D SDfile   Computed 3D by Vconf -m prep SDfile
Find this compound or compounds like it in BindingDB:
Activity Spreadsheet -- Enzyme Inhibition Constant Data from BindingDB
Found 1 hit for monomerid = 50031964
TargetType-1 angiotensin II receptor(Homo sapiens (Human))
Shionogi
Curated by ChEMBL
LigandPNGBDBM50031964(3-[(5-Ethyl-pyrazolo[1,5-a]pyrimidin-7-ylamino)-me...)
Affinity DataKi:  1.10nM. Assay description: Ability to displace [125I]-AII binding to COS cells transfected with a cDNA encoding human Angiotensin II receptor, type 1
In DepthDetails ArticlePubMed