BDBM50032093 CHEMBL96456::N*2*-(4-Fluoro-2-methyl-phenyl)-N*4*-methyl-N*4*-phenyl-thieno[2,3-d]pyrimidine-2,4-diamine
SMILES CN(c1ccccc1)c1nc(Nc2ccc(F)cc2C)nc2sccc12
InChI Key InChIKey=IJWMABWJZIUTFU-UHFFFAOYSA-N
Data  1 IC50
  Tab Delimited (TSV)   2D SDfile   Computed 3D by Vconf -m prep SDfile
Find this compound or compounds like it in BindingDB:
Activity Spreadsheet -- Enzyme Inhibition Constant Data from BindingDB
Found 1 hit for monomerid = 50032093
TargetPotassium-transporting ATPase alpha chain 1/subunit beta(Sus scrofa (Pig))
Smithkline Beecham Pharmaceuticals R&D
Curated by ChEMBL
LigandPNGBDBM50032093(CHEMBL96456 | N*2*-(4-Fluoro-2-methyl-phenyl)-N*4*...)
Affinity DataIC50:  130nM. Assay description: Inhibition of K+ stimulated gastric ATPase activity
In DepthDetails ArticlePubMed