BDBM50032252 CHEMBL3352982
SMILES COc1ccc(cc1)-c1ccc(OCCCN2CCc3cc(OC)c(OC)cc3C2)cc1
InChI Key InChIKey=TVEJWPKOIQUYKT-UHFFFAOYSA-N
Data  1 EC50
  Tab Delimited (TSV)   2D SDfile   Computed 3D by Vconf -m prep SDfile
Find this compound or compounds like it in BindingDB:
Activity Spreadsheet -- Enzyme Inhibition Constant Data from BindingDB
Found 1 hit for monomerid = 50032252
TargetATP-dependent translocase ABCB1(Homo sapiens (Human))
Universit£
Curated by ChEMBL
LigandPNGBDBM50032252(CHEMBL3352982)
Affinity DataEC50:  1.30E+3nM. Assay description: Inhibition of MDR1 (unknown origin) over-expressed in MDCK cells assessed as calcein accumulation incubated for 30 mins prior to Calcein-AM addition ...
In DepthDetails ArticlePubMed