BDBM50032293 CHEMBL3352828
SMILES COc1c(Cl)scc1C(=O)N1CCC1(C)C(=O)N(C)Cc1ccc(Cl)cc1
InChI Key InChIKey=LZWCFMJRFJMIGO-UHFFFAOYSA-N
Data  1 IC50
  Tab Delimited (TSV)   2D SDfile   Computed 3D by Vconf -m prep SDfile
Find this compound or compounds like it in BindingDB:
Activity Spreadsheet -- Enzyme Inhibition Constant Data from BindingDB
Found 1 hit for monomerid = 50032293
TargetFree fatty acid receptor 2(Homo sapiens (Human))
Galapagos
Curated by ChEMBL
LigandPNGBDBM50032293(CHEMBL3352828)
Affinity DataIC50:  3.35E+3nM. Assay description: Antagonist activity against human FFA2 receptor expressed in HEK293 cells assessed as inhibition of sodium acetate-induced calcium mobilization
In DepthDetails ArticlePubMed