BDBM50032338 CHEMBL3353512
SMILES CC1(CCN1C(=O)c1csc2ccccc12)C(=O)N(CCCC(O)=O)c1cccc(Cl)c1
InChI Key InChIKey=LNDXMENNSDMEHD-UHFFFAOYSA-N
Data  1 IC50
  Tab Delimited (TSV)   2D SDfile   Computed 3D by Vconf -m prep SDfile
Find this compound or compounds like it in BindingDB:
Activity Spreadsheet -- Enzyme Inhibition Constant Data from BindingDB
Found 1 hit for monomerid = 50032338
TargetFree fatty acid receptor 2(Homo sapiens (Human))
Galapagos
Curated by ChEMBL
LigandPNGBDBM50032338(CHEMBL3353512)
Affinity DataIC50:  347nM. Assay description: Antagonist activity against human FFA2 receptor expressed in HEK293 cells assessed as inhibition of sodium acetate-induced calcium mobilization
In DepthDetails ArticlePubMed