BDBM50032350 CHEMBL3353524
SMILES Cc1cc(C)cc(CC(=O)N2CCC2(C)C(=O)N(CCCC(O)=O)Cc2ccc(cc2)C(F)(F)F)c1
InChI Key InChIKey=IISRXBZYWKGMAS-UHFFFAOYSA-N
Data  1 IC50
  Tab Delimited (TSV)   2D SDfile   Computed 3D by Vconf -m prep SDfile
Find this compound or compounds like it in BindingDB:
Activity Spreadsheet -- Enzyme Inhibition Constant Data from BindingDB
Found 1 hit for monomerid = 50032350
TargetFree fatty acid receptor 2(Homo sapiens (Human))
Galapagos
Curated by ChEMBL
LigandPNGBDBM50032350(CHEMBL3353524)
Affinity DataIC50:  551nM. Assay description: Antagonist activity against human FFA2 receptor expressed in HEK293 cells assessed as inhibition of sodium acetate-induced calcium mobilization
In DepthDetails ArticlePubMed