BDBM50032696 CHEMBL3354674
SMILES N[C@@H](CCCNC(N)=N)C(=O)N[C@@H](CCC(N)=O)C(=O)N1CCC[C@H]1C(=O)N[C@@H](CCCNC(N)=N)C(=O)c1nc2ccccc2s1
InChI Key InChIKey=WQMSWWQUUDQCDN-LEAZDLGRSA-N
Data  2 KI
  Tab Delimited (TSV)   2D SDfile   Computed 3D by Vconf -m prep SDfile
Find this compound or compounds like it in BindingDB:
Activity Spreadsheet -- Enzyme Inhibition Constant Data from BindingDB
Found 2 hits for monomerid = 50032696
TargetSuppressor of tumorigenicity 14 protein(Homo sapiens (Human))
Universit£
Curated by ChEMBL
LigandPNGBDBM50032696(CHEMBL3354674)
Affinity DataKi:  0.0610nM. Assay description: Inhibition of human recombinant matriptase using Boc-Gln-Ala-Arg-AMC as substrate by microplate reader analysis
In DepthDetails ArticlePubMed
TargetTransmembrane protease serine 6(Homo sapiens (Human))
Universit£
Curated by ChEMBL
LigandPNGBDBM50032696(CHEMBL3354674)
Affinity DataKi:  7.80nM. Assay description: Inhibition of human recombinant matriptase-2 using Boc-Gln-Ala-Arg-AMC as substrate by microplate reader analysis
In DepthDetails ArticlePubMed