BDBM50032713 CHEMBL3354689
SMILES CC(C)(C)C#Cc1ccc2Oc3ccc(cc3[C@@]3(COC(N)=N3)c2c1)-c1cncnc1
InChI Key InChIKey=HBGLVJABBICLQC-RUZDIDTESA-N
Data  1 KI  2 IC50
  Tab Delimited (TSV)   2D SDfile   Computed 3D by Vconf -m prep SDfile
Find this compound or compounds like it in BindingDB:
Activity Spreadsheet -- Enzyme Inhibition Constant Data from BindingDB
Found 3 hits for monomerid = 50032713
TargetPotassium voltage-gated channel subfamily H member 2(Homo sapiens (Human))
Amgen
Curated by ChEMBL
LigandPNGBDBM50032713(CHEMBL3354689)
Affinity DataKi:  150nM. Assay description: Inhibition of human ERG expressing HEK293 cells by [3H]dofetilide binding assay
In DepthDetails ArticlePubMed
TargetBeta-secretase 1(Homo sapiens (Human))
Amgen
Curated by ChEMBL
LigandPNGBDBM50032713(CHEMBL3354689)
Affinity DataIC50:  36nM. Assay description: Inhibition of BACE1 in HEK293T cells expressing APPswedish mutant assessed as inhibition of amyloid beta 40 production by sandwich ELISA
In DepthDetails ArticlePubMed
TargetBeta-secretase 1(Homo sapiens (Human))
Amgen
Curated by ChEMBL
LigandPNGBDBM50032713(CHEMBL3354689)
Affinity DataIC50:  2nM. Assay description: Inhibition of BACE1 (unknown origin) assessed as enhancement of fluorescence intensity
In DepthDetails ArticlePubMed