BDBM50032963 (S)-4-Amino-3-(4-chloro-phenyl)-butyric acid::BACLOFEN::CHEMBL302213
SMILES NC[C@@H](CC(O)=O)c1ccc(Cl)cc1
InChI Key InChIKey=KPYSYYIEGFHWSV-MRVPVSSYSA-N
Data  2 IC50
  Tab Delimited (TSV)   2D SDfile   Computed 3D by Vconf -m prep SDfile
Find this compound or compounds like it in BindingDB:
Activity Spreadsheet -- Enzyme Inhibition Constant Data from BindingDB
Found 2 hits for monomerid = 50032963
TargetGamma-aminobutyric acid type B receptor subunit 1/2(Rattus norvegicus (Rat))
The Royal Danish School Of Pharmacy
Curated by ChEMBL
LigandPNGBDBM50032963((S)-4-Amino-3-(4-chloro-phenyl)-butyric acid | BAC...)
Affinity DataIC50: >140nM. Assay description: Displacement of [3H]-GABA from Gamma-aminobutyric acid type B receptor
In DepthDetails ArticlePubMed
TargetGamma-aminobutyric acid type B receptor subunit 1/2(Homo sapiens (Human))
Ciba-Geigy
Curated by ChEMBL
LigandPNGBDBM50032963((S)-4-Amino-3-(4-chloro-phenyl)-butyric acid | BAC...)
Affinity DataIC50:  1.77E+3nM. Assay description: Inhibition of [3H]-baclofen binding to Gamma-aminobutyric acid type B receptor of cat cerebellum
In DepthDetails ArticlePubMed