BDBM50033011 CHEMBL114128::[3-Amino-2-(4-chloro-phenyl)-propyl]-methyl-phosphinic acid
SMILES CP(O)(=O)CC(CN)c1ccc(Cl)cc1
InChI Key InChIKey=FPSHIRLRKJJOJC-UHFFFAOYSA-N
Data  1 IC50
  Tab Delimited (TSV)   2D SDfile   Computed 3D by Vconf -m prep SDfile
Find this compound or compounds like it in BindingDB:
Activity Spreadsheet -- Enzyme Inhibition Constant Data from BindingDB
Found 1 hit for monomerid = 50033011
TargetGamma-aminobutyric acid type B receptor subunit 1(Rattus norvegicus (Rat))
Ciba-Geigy
Curated by ChEMBL
LigandPNGBDBM50033011(CHEMBL114128 | [3-Amino-2-(4-chloro-phenyl)-propyl...)
Affinity DataIC50:  9.00E+3nM. Assay description: Inhibition of binding of [3H]-CGP-27,492 to gamma-aminobutyric acid type B receptor of rat cortex.
In DepthDetails ArticlePubMed