BDBM50033170 CHEMBL3357108
SMILES COc1ccc(cc1)C1=C(C(=O)OC1)c1cccc(Cl)c1F
InChI Key InChIKey=BGVJMWUSKQYXIA-UHFFFAOYSA-N
Data  2 IC50
  Tab Delimited (TSV)   2D SDfile   Computed 3D by Vconf -m prep SDfile
Find this compound or compounds like it in BindingDB:
Activity Spreadsheet -- Enzyme Inhibition Constant Data from BindingDB
Found 2 hits for monomerid = 50033170
TargetProstaglandin G/H synthase 1(Ovis aries (Sheep))
Vanderbilt University School Of Medicine
Curated by ChEMBL
LigandPNGBDBM50033170(CHEMBL3357108)
Affinity DataIC50:  300nM. Assay description: Inhibition of ovine COX-1 assessed as inhibition of [14C]arachidonic acid to radiolabeled prostaglandins preincubated for 15 mins by TLC-based assay
In DepthDetails ArticlePubMed
TargetProstaglandin G/H synthase 2(Mus musculus (Mouse))
Vanderbilt University School Of Medicine
Curated by ChEMBL
LigandPNGBDBM50033170(CHEMBL3357108)
Affinity DataIC50: >2.50E+4nM. Assay description: Inhibition of mouse COX-2 assessed as inhibition of [14C]arachidonic acid to radiolabeled prostaglandins preincubated for 15 mins by TLC-based assay
In DepthDetails ArticlePubMed