BDBM50033262 1,3-Dimethyl-5-[4-(2-methyl-imidazo[4,5-c]pyridin-1-yl)-phenyl]-6,8-dihydro-1H-pyrazolo[3,4-b][1,4]diazepin-7-one::CHEMBL325928
SMILES Cc1nn(C)c2NC(=O)CC(=Nc12)c1ccc(cc1)-n1c(C)nc2cnccc12
InChI Key InChIKey=BNIQTMIZFAHZET-UHFFFAOYSA-N
Data  1 IC50
  Tab Delimited (TSV)   2D SDfile   Computed 3D by Vconf -m prep SDfile
Find this compound or compounds like it in BindingDB:
Activity Spreadsheet -- Enzyme Inhibition Constant Data from BindingDB
Found 1 hit for monomerid = 50033262
TargetPlatelet-activating factor receptor(Cavia porcellus)
Pfizer
Curated by ChEMBL
LigandPNGBDBM50033262(1,3-Dimethyl-5-[4-(2-methyl-imidazo[4,5-c]pyridin-...)
Affinity DataIC50:  26nM. Assay description: In vitro antagonist activity against platelet activating factor (PAF) receptor, using washed rabbit platelets
In DepthDetails ArticlePubMed