BDBM50033345 (5-Methyl-isoxazol-3-yl)-(2-phenyl-quinazolin-4-yl)-amine::CHEMBL119309
SMILES Cc1cc(Nc2nc(nc3ccccc23)-c2ccccc2)no1
InChI Key InChIKey=PFZCLFYAOOWJHH-UHFFFAOYSA-N
Data  1 KI  1 IC50
  Tab Delimited (TSV)   2D SDfile   Computed 3D by Vconf -m prep SDfile
Find this compound or compounds like it in BindingDB:
Activity Spreadsheet -- Enzyme Inhibition Constant Data from BindingDB
Found 2 hits for monomerid = 50033345
TargetGlycogen synthase kinase-3(Homo sapiens (Human))
Vertex Pharmaceuticals
Curated by ChEMBL
LigandPNGBDBM50033345((5-Methyl-isoxazol-3-yl)-(2-phenyl-quinazolin-4-yl...)
Affinity DataKi: >2.00E+3nM. Assay description: Inhibition of Glycogen synthase kinase-3
In DepthDetails ArticlePubMed
TargetcGMP-specific 3',5'-cyclic phosphodiesterase(Homo sapiens (Human))
Biofor
Curated by ChEMBL
LigandPNGBDBM50033345((5-Methyl-isoxazol-3-yl)-(2-phenyl-quinazolin-4-yl...)
Affinity DataIC50:  3.60E+3nM. Assay description: Inhibitory activity against phosphodiesterase 5 from human platelets
In DepthDetails ArticlePubMed