BDBM50033561 CHEMBL438728::Tyr-Ser-Phe-Lys-Asp-Met-Pro-Leu-Phe-Arg
SMILES CSCC[C@H](NC(=O)[C@H](CC(O)=O)NC(=O)[C@H](CCCCN)NC(=O)[C@H](Cc1ccccc1)NC(=O)[C@H](CO)NC(=O)[C@@H](N)Cc1ccc(O)cc1)C(=O)N1CCC[C@H]1C(=O)N[C@@H](CC(C)C)C(=O)N[C@H](Cc1ccccc1)C(=O)N[C@@H](CCCNC(N)=N)C(O)=O
InChI Key InChIKey=GLRNBVXDKNGXIZ-NJUBILFWSA-N
Data  2 EC50
  Tab Delimited (TSV)   2D SDfile   Computed 3D by Vconf -m prep SDfile
Find this compound or compounds like it in BindingDB:
Activity Spreadsheet -- Enzyme Inhibition Constant Data from BindingDB
Found 2 hits for monomerid = 50033561
TargetC5a anaphylatoxin chemotactic receptor 1(Homo sapiens (Human))
University Of Nebraska Medical Center
Curated by ChEMBL
LigandPNGBDBM50033561(CHEMBL438728 | Tyr-Ser-Phe-Lys-Asp-Met-Pro-Leu-Phe...)
Affinity DataEC50:  4.00E+3nM. Assay description: Abilitiy to induce shape change (polarization) in human polymorphonuclear leukocytes (PMN)
In DepthDetails ArticlePubMed
TargetC5a anaphylatoxin chemotactic receptor 1(Homo sapiens (Human))
University Of Nebraska Medical Center
Curated by ChEMBL
LigandPNGBDBM50033561(CHEMBL438728 | Tyr-Ser-Phe-Lys-Asp-Met-Pro-Leu-Phe...)
Affinity DataEC50:  1.14E+5nM. Assay description: Release of beta-glucuronidase from human polymorphonuclear leukocytes(PMN)
In DepthDetails ArticlePubMed