BDBM50033574 CHEMBL261966::Tyr-Ser-Phe-Lys-Asp-Met-Gln-Leu-Pro-Arg
SMILES CSCC[C@H](NC(=O)[C@H](CC(O)=O)NC(=O)[C@H](CCCCN)NC(=O)[C@H](Cc1ccccc1)NC(=O)[C@H](CO)NC(=O)[C@@H](N)Cc1ccc(O)cc1)C(=O)N[C@@H](CCC(N)=O)C(=O)N[C@@H](CC(C)C)C(=O)N1CCC[C@H]1C(=O)N[C@@H](CCCNC(N)=N)C(O)=O
InChI Key InChIKey=AZSXYYMZPKHZIY-BQBSFLCNSA-N
Data  2 EC50
  Tab Delimited (TSV)   2D SDfile   Computed 3D by Vconf -m prep SDfile
Find this compound or compounds like it in BindingDB:
Activity Spreadsheet -- Enzyme Inhibition Constant Data from BindingDB
Found 2 hits for monomerid = 50033574
TargetC5a anaphylatoxin chemotactic receptor 1(Homo sapiens (Human))
University Of Nebraska Medical Center
Curated by ChEMBL
LigandPNGBDBM50033574(CHEMBL261966 | Tyr-Ser-Phe-Lys-Asp-Met-Gln-Leu-Pro...)
Affinity DataEC50: >1.00E+6nM. Assay description: Release of beta-glucuronidase from human polymorphonuclear leukocytes(PMN)
In DepthDetails ArticlePubMed
TargetC5a anaphylatoxin chemotactic receptor 1(Homo sapiens (Human))
University Of Nebraska Medical Center
Curated by ChEMBL
LigandPNGBDBM50033574(CHEMBL261966 | Tyr-Ser-Phe-Lys-Asp-Met-Gln-Leu-Pro...)
Affinity DataEC50:  5.00E+5nM. Assay description: Abilitiy to induce shape change (polarization) in human polymorphonuclear leukocytes (PMN)
In DepthDetails ArticlePubMed