BDBM50033654 1N-[10-methoxy-4-methyl-14-oxo-(13R,17S)-12-oxa-4-azapentacyclo[9.6.1.01,13.05,17.07,18]octadeca-7(18),8,10-trien-17-yl]-4-(4-nitrophenyl)-(Z)-2-butenamide::CHEMBL106876
SMILES COc1ccc2CC3N(C)CCC45[C@@H](Oc1c24)C(=O)CC[C@@]35NC(=O)\C=C\c1ccc(cc1)[N+]([O-])=O
InChI Key InChIKey=VSIGMWSIMODNPX-WXYYCSAXSA-N
Data  3 IC50
  Tab Delimited (TSV)   2D SDfile   Computed 3D by Vconf -m prep SDfile
Find this compound or compounds like it in BindingDB:
Activity Spreadsheet -- Enzyme Inhibition Constant Data from BindingDB
Found 3 hits for monomerid = 50033654
TargetDelta-type opioid receptor(Homo sapiens (Human))
Institute
Curated by ChEMBL
LigandPNGBDBM50033654(1N-[10-methoxy-4-methyl-14-oxo-(13R,17S)-12-oxa-4-...)
Affinity DataIC50:  20nM. Assay description: Binding affinity against delta opioid receptor from calf frontal cortex.
In DepthDetails ArticlePubMed
TargetKappa-type opioid receptor(Homo sapiens (Human))
Institute
Curated by ChEMBL
LigandPNGBDBM50033654(1N-[10-methoxy-4-methyl-14-oxo-(13R,17S)-12-oxa-4-...)
Affinity DataIC50:  27nM. Assay description: Binding affinity against kappa opioid receptor from calf frontal cortex.
In DepthDetails ArticlePubMed
TargetMu-type opioid receptor(CALF)
Institute
Curated by ChEMBL
LigandPNGBDBM50033654(1N-[10-methoxy-4-methyl-14-oxo-(13R,17S)-12-oxa-4-...)
Affinity DataIC50:  0.440nM. Assay description: Binding affinity against mu opioid receptor from calf frontal cortex.
In DepthDetails ArticlePubMed