BDBM50033670 (S)-2-[(R)-5-({1-[2-(2-Amino-5-guanidino-pentanoylamino)-5-guanidino-pentanoyl]-pyrrolidine-2-carbonyl}-amino)-2-benzyl-6-(4-hydroxy-phenyl)-4-oxo-hexanoylamino]-4-methyl-pentanoic acid::CHEMBL269292
SMILES CC(C)C[C@H](NC(=O)[C@@H](CC(=O)C(Cc1ccc(O)cc1)NC(=O)C1CCCN1C(=O)C(CCCNC(N)=N)NC(=O)C(N)CCCNC(N)=N)Cc1ccccc1)C(O)=O
InChI Key InChIKey=XITHLWPPLFKPTF-SVBSGVHASA-N
Data  1 IC50
  Tab Delimited (TSV)   2D SDfile   Computed 3D by Vconf -m prep SDfile
Find this compound or compounds like it in BindingDB:
Activity Spreadsheet -- Enzyme Inhibition Constant Data from BindingDB
Found 1 hit for monomerid = 50033670
TargetNeurotensin receptor type 1(Rattus norvegicus)
Instituto De Qu£Mica M£Dica (Csic)
Curated by ChEMBL
LigandPNGBDBM50033670((S)-2-[(R)-5-({1-[2-(2-Amino-5-guanidino-pentanoyl...)
Affinity DataIC50:  15nM. Assay description: IC50 was measured as binding to rat cortex membranes using [3H]- NT(neurotensin) as tracer
In DepthDetails ArticlePubMed