BDBM50033671 (S)-2-{(R)-2-[2-({1-[2-(2-Amino-5-guanidino-pentanoylamino)-5-guanidino-pentanoyl]-pyrrolidine-2-carbonyl}-amino)-3-(4-hydroxy-phenyl)-propionylamino]-3-phenyl-propionylamino}-4-methyl-pentanoic acid::CHEMBL2371276
SMILES [#6]-[#6](-[#6])-[#6]-[#6@H](-[#7]-[#6](=O)-[#6@@H](-[#6]-c1ccccc1)-[#7]-[#6](=O)-[#6@H](-[#6]-c1ccc(-[#8])cc1)-[#7]-[#6](=O)-[#6@@H]-1-[#6]-[#6]-[#6]-[#7]-1-[#6](=O)-[#6@H](-[#6]-[#6]-[#6]\[#7]=[#6](/[#7])-[#7])-[#7]-[#6](=O)-[#6@@H](-[#7])-[#6]-[#6]-[#6]\[#7]=[#6](/[#7])-[#7])-[#6](-[#8])=O
InChI Key InChIKey=KXUDJKLVHYPLAH-QXDHOACBSA-N
Data  1 IC50
  Tab Delimited (TSV)   2D SDfile   Computed 3D by Vconf -m prep SDfile
Find this compound or compounds like it in BindingDB:
Activity Spreadsheet -- Enzyme Inhibition Constant Data from BindingDB
Found 1 hit for monomerid = 50033671
TargetNeurotensin receptor type 1(Rattus norvegicus)
Instituto De Qu£Mica M£Dica (Csic)
Curated by ChEMBL
LigandPNGBDBM50033671((S)-2-{(R)-2-[2-({1-[2-(2-Amino-5-guanidino-pentan...)
Affinity DataIC50:  8nM. Assay description: IC50 was measured as binding to rat cortex membranes using [3H]- NT(neurotensin) as tracer
In DepthDetails ArticlePubMed