BDBM50033818 5-(1H-Indol-3-ylmethyl)-3-(3-trifluoromethyl-benzyl)-oxazolidine-2,4-dione::CHEMBL123764::CHEMBL367423
SMILES Oc1c(Cc2c[nH]c3ccccc23)oc(=O)n1Cc1cccc(c1)C(F)(F)F
InChI Key InChIKey=XBFAQMGEJJVSCU-UHFFFAOYSA-N
Data  2 IC50
  Tab Delimited (TSV)   2D SDfile   Computed 3D by Vconf -m prep SDfile
Find this compound or compounds like it in BindingDB:
Activity Spreadsheet -- Enzyme Inhibition Constant Data from BindingDB
Found 2 hits for monomerid = 50033818
TargetSubstance-P receptor(Homo sapiens (Human))
Washington University
Curated by ChEMBL
LigandPNGBDBM50033818(5-(1H-Indol-3-ylmethyl)-3-(3-trifluoromethyl-benzy...)
Affinity DataIC50:  2.69E+3nM. Assay description: Binding affinity was measured against the Tachykinin receptor 1 in CHO-expressed hNK1 using [125I]SP.
In DepthDetails ArticlePubMed
TargetSubstance-P receptor(Homo sapiens (Human))
Washington University
Curated by ChEMBL
LigandPNGBDBM50033818(5-(1H-Indol-3-ylmethyl)-3-(3-trifluoromethyl-benzy...)
Affinity DataIC50:  2.67E+3nM. Assay description: Binding affinity at human Tachykinin receptor 1 expressed in CHO cells by [125 I]Trp8-substance P displacement.
In DepthDetails ArticlePubMed